Task 112010593199

wallet: Store information about created and imported multipath descriptors

2026-10-05 22:33:43 failed wallet-store-multipath a49e42b8bb704f1e7a3ea2f0b1a1d34ee7c182df


Commands that took longer than 1 second (total 2m25s)
linedurationpercentagecommand
11569s6%docker buildx build --file=/home/runner/work/bitcoin/bitcoin/ci/test_imagefile --build-arg=CI_IMAGE_NAME_TAG=mirror.gcr.io/alpine:3.24 --build-arg=FILE_ENV=./ci/test/00_setup_env_native_alpine_musl.sh --build-arg=BASE_ROOT_DIR=/home/runner/work/_temp --platform=linux --label=bitcoin-ci-test --tag=ci_native_alpine_musl --cache-from type=gha,url=http://127.0.0.1:49160/,version=1,scope=ci_native_alpine_musl --load /home/runner/work/bitcoin/bitcoin
168310s6%not recognized
17586s4%features - done
21821m4s44%cmake --build '/home/runner/work/_temp/build_ ₿🧪_' -j8 --target all install
26653s2%-DABORT_ON_FAILED_ASSUME -DDEBUG -DDEBUG_LOCKCONTENTION -DDEBUG_LOCKORDER -DKJ_USE_FIBERS=0 -DRPC_DOC_CHECK -D_GLIBCXX_DEBUG -D_GLIBCXX_DEBUG_PEDANTIC -D_LIBCPP_HARDENING_MODE=_LIBCPP_HARDENING_MODE_DEBUG -I"/home/runner/work/_temp/build_ ₿🧪_/src/ipc/libmultiprocess/test" -I/home/runner/work/_temp/src/ipc/libmultiprocess/include -I/home/runner/work/_temp/src/ipc/libmultiprocess/test -I"/home/runner/work/_temp/build_ ₿🧪_/src/ipc/libmultiprocess/include" -isystem /home/runner/work/_temp/depends/x86_64-pc-linux-musl/include -O0 -ftrapv -O1 -g3 -g3 -std=c++20 -fPIE -fvisibility=hidden -fvisibility-inlines-hidden -pthread -fno-extended-identifiers -fmacro-prefix-map=/home/runner/work/_temp/src=. -fstack-reuse=none -U_FORTIFY_SOURCE -D_FORTIFY_SOURCE=3 -Wstack-protector -fstack-protector-all -fcf-protection=full -fstack-clash-protection -Wall -Wextra -Wformat -Wformat-security -Wvla -Wredundant-decls -Wunused-const-variable -Wdate-time -Wduplicated-branches -Wduplicated-cond -Wlogical-op -Woverloaded-virtual -Wsuggest-override -Wimplicit-fallthrough -Wunreachable-code -Wbidi-chars=any -Wundef -Wleading-whitespace=spaces -Wtrailing-whitespace=any -Wno-unused-parameter -Werror -MD -MT src/ipc/libmultiprocess/test/CMakeFiles/mptest.dir/mp/test/listen_tests.cpp.o -MF CMakeFiles/mptest.dir/mp/test/listen_tests.cpp.o.d -o CMakeFiles/mptest.dir/mp/test/listen_tests.cpp.o -c /home/runner/work/_temp/src/ipc/libmultiprocess/test/mp/test/listen_tests.cpp
26772s1%-DABORT_ON_FAILED_ASSUME -DDEBUG -DDEBUG_LOCKCONTENTION -DDEBUG_LOCKORDER -DKJ_USE_FIBERS=0 -DRPC_DOC_CHECK -D_GLIBCXX_DEBUG -D_GLIBCXX_DEBUG_PEDANTIC -D_LIBCPP_HARDENING_MODE=_LIBCPP_HARDENING_MODE_DEBUG -I"/home/runner/work/_temp/build_ ₿🧪_/src/ipc/libmultiprocess/test" -I/home/runner/work/_temp/src/ipc/libmultiprocess/include -I/home/runner/work/_temp/src/ipc/libmultiprocess/test -I"/home/runner/work/_temp/build_ ₿🧪_/src/ipc/libmultiprocess/include" -isystem /home/runner/work/_temp/depends/x86_64-pc-linux-musl/include -O0 -ftrapv -O1 -g3 -g3 -std=c++20 -fPIE -fvisibility=hidden -fvisibility-inlines-hidden -pthread -fno-extended-identifiers -fmacro-prefix-map=/home/runner/work/_temp/src=. -fstack-reuse=none -U_FORTIFY_SOURCE -D_FORTIFY_SOURCE=3 -Wstack-protector -fstack-protector-all -fcf-protection=full -fstack-clash-protection -Wall -Wextra -Wformat -Wformat-security -Wvla -Wredundant-decls -Wunused-const-variable -Wdate-time -Wduplicated-branches -Wduplicated-cond -Wlogical-op -Woverloaded-virtual -Wsuggest-override -Wimplicit-fallthrough -Wunreachable-code -Wbidi-chars=any -Wundef -Wleading-whitespace=spaces -Wtrailing-whitespace=any -Wno-unused-parameter -Werror -MD -MT src/ipc/libmultiprocess/test/CMakeFiles/mptest.dir/mp/test/foo.capnp.proxy-types.c++.o -MF CMakeFiles/mptest.dir/mp/test/foo.capnp.proxy-types.c++.o.d -o CMakeFiles/mptest.dir/mp/test/foo.capnp.proxy-types.c++.o -c "/home/runner/work/_temp/build_ ₿🧪_/src/ipc/libmultiprocess/test/mp/test/foo.capnp.proxy-types.c++"
27893s2%-DABORT_ON_FAILED_ASSUME -DDEBUG -DDEBUG_LOCKCONTENTION -DDEBUG_LOCKORDER -DRPC_DOC_CHECK -D_GLIBCXX_DEBUG -D_GLIBCXX_DEBUG_PEDANTIC -D_LIBCPP_HARDENING_MODE=_LIBCPP_HARDENING_MODE_DEBUG -I"/home/runner/work/_temp/build_ ₿🧪_/src" -I/home/runner/work/_temp/src -O0 -ftrapv -O1 -g3 -g3 -std=c++20 -fPIC -fvisibility=hidden -fvisibility-inlines-hidden -fno-extended-identifiers -fmacro-prefix-map=/home/runner/work/_temp/src=. -fstack-reuse=none -U_FORTIFY_SOURCE -D_FORTIFY_SOURCE=3 -Wstack-protector -fstack-protector-all -fcf-protection=full -fstack-clash-protection -Wall -Wextra -Wformat -Wformat-security -Wvla -Wredundant-decls -Wunused-const-variable -Wdate-time -Wduplicated-branches -Wduplicated-cond -Wlogical-op -Woverloaded-virtual -Wsuggest-override -Wimplicit-fallthrough -Wunreachable-code -Wbidi-chars=any -Wundef -Wleading-whitespace=spaces -Wtrailing-whitespace=any -Wno-unused-parameter -Werror -MD -MT src/util/CMakeFiles/bitcoin_util.dir/bip32.cpp.o -MF CMakeFiles/bitcoin_util.dir/bip32.cpp.o.d -o CMakeFiles/bitcoin_util.dir/bip32.cpp.o -c /home/runner/work/_temp/src/util/bip32.cpp
Tags
  • Alpine (musl)
  • wallet-store-multipath
  • FAILED