Task 104914653536

Remove boost as a unit test runner

2026-09-16 18:02:25 failed remove-boost-test 15b17fe9730e073458222d30d7c9b41b4163a6e3


Commands that took longer than 1 second (total 3m22s)
linedurationpercentagecommand
11547s3%docker buildx build --file=/home/runner/work/bitcoin/bitcoin/ci/test_imagefile --build-arg=CI_IMAGE_NAME_TAG=mirror.gcr.io/alpine:3.24 --build-arg=FILE_ENV=./ci/test/00_setup_env_native_alpine_musl.sh --build-arg=BASE_ROOT_DIR=/home/runner/work/_temp --platform=linux --label=bitcoin-ci-test --tag=ci_native_alpine_musl --cache-from type=gha,url=http://127.0.0.1:49160/,version=1,scope=ci_native_alpine_musl --load /home/runner/work/bitcoin/bitcoin
14271s0%retry curl --location --fail https://github.com/bitcoin-core/qa-assets/raw/main/unit_test_data/script_assets_test.json -o '/home/runner/work/_temp/ci/scratch_ ₿🧪_/qa-assets/unit_test_data//script_assets_test.json'
167214s6%not recognized
17556s2%features - done
217526s12%cmake --build '/home/runner/work/_temp/build_ ₿🧪_' -j8 --target all install
29374s1%" " #op " " + stringify(rhs)); \
35124s1%-O0 -ftrapv -O1 -g3 -g3 -fstack-reuse=none -fstack-protector-all -fcf-protection=full -fstack-clash-protection -Wl,-z,relro -Wl,-z,now -Wl,-z,separate-code -Wl,--exclude-libs,ALL -fPIE -pie -Wl,--dependency-file=CMakeFiles/bitcoind.dir/link.d CMakeFiles/bitcoind.dir/bitcoind.cpp.o CMakeFiles/bitcoind.dir/init/bitcoind.cpp.o -o ../bin/bitcoind ../lib/libbitcoin_node.a ../lib/libbitcoin_wallet.a ../lib/libbitcoin_zmq.a /home/runner/work/_temp/depends/x86_64-pc-linux-musl/lib/libzmq.a libleveldb.a libcrc32c.a libminisketch.a ../lib/libbitcoin_common.a ../lib/libbitcoin_util.a ../lib/libbitcoin_clientversion.a ../lib/libbitcoin_consensus.a ../lib/libbitcoin_crypto.a secp256k1/lib/libsecp256k1.a univalue/libunivalue.a /home/runner/work/_temp/depends/x86_64-pc-linux-musl/lib/libsqlite3.a
35585s2%-DABORT_ON_FAILED_ASSUME -DDEBUG -DDEBUG_LOCKCONTENTION -DDEBUG_LOCKORDER -DRPC_DOC_CHECK -D_GLIBCXX_DEBUG -D_GLIBCXX_DEBUG_PEDANTIC -D_LIBCPP_HARDENING_MODE=_LIBCPP_HARDENING_MODE_DEBUG -I"/home/runner/work/_temp/build_ ₿🧪_/src" -I/home/runner/work/_temp/src -I"/home/runner/work/_temp/build_ ₿🧪_/src/ipc" -I/home/runner/work/_temp/src/ipc/libmultiprocess/include -O0 -ftrapv -O1 -g3 -g3 -std=c++20 -fPIE -fvisibility=hidden -fvisibility-inlines-hidden -fno-extended-identifiers -fmacro-prefix-map=/home/runner/work/_temp/src=. -fstack-reuse=none -U_FORTIFY_SOURCE -D_FORTIFY_SOURCE=3 -Wstack-protector -fstack-protector-all -fcf-protection=full -fstack-clash-protection -Wall -Wextra -Wformat -Wformat-security -Wvla -Wredundant-decls -Wdate-time -Wduplicated-branches -Wduplicated-cond -Wlogical-op -Woverloaded-virtual -Wsuggest-override -Wimplicit-fallthrough -Wunreachable-code -Wbidi-chars=any -Wundef -Wleading-whitespace=spaces -Wtrailing-whitespace=any -Wno-unused-parameter -Werror -MD -MT src/CMakeFiles/bitcoin-node.dir/init/bitcoin-node.cpp.o -MF CMakeFiles/bitcoin-node.dir/init/bitcoin-node.cpp.o.d -o CMakeFiles/bitcoin-node.dir/init/bitcoin-node.cpp.o -c /home/runner/work/_temp/src/init/bitcoin-node.cpp
38172s0%-DABORT_ON_FAILED_ASSUME -DBOOST_MULTI_INDEX_DISABLE_SERIALIZATION -DDEBUG -DDEBUG_LOCKCONTENTION -DDEBUG_LOCKORDER -DQT_CORE_LIB -DQT_DBUS_LIB -DQT_GUI_LIB -DQT_NETWORK_LIB -DQT_NO_KEYWORDS -DQT_USE_QSTRINGBUILDER -DQT_WIDGETS_LIB -DRPC_DOC_CHECK -D_GLIBCXX_DEBUG -D_GLIBCXX_DEBUG_PEDANTIC -D_LIBCPP_HARDENING_MODE=_LIBCPP_HARDENING_MODE_DEBUG -I"/home/runner/work/_temp/build_ ₿🧪_/src/qt/bitcoinqt_autogen/include" -I"/home/runner/work/_temp/build_ ₿🧪_/src" -I/home/runner/work/_temp/src -I/home/runner/work/_temp/src/univalue/include -I/home/runner/work/_temp/src/leveldb/include -isystem /home/runner/work/_temp/depends/x86_64-pc-linux-musl/include/QtWidgets -isystem /home/runner/work/_temp/depends/x86_64-pc-linux-musl/include -isystem /home/runner/work/_temp/depends/x86_64-pc-linux-musl/include/QtCore -isystem /home/runner/work/_temp/depends/x86_64-pc-linux-musl/mkspecs/linux-g++ -isystem /home/runner/work/_temp/depends/x86_64-pc-linux-musl/include/QtGui -isystem /home/runner/work/_temp/depends/x86_64-pc-linux-musl/boost/include -isystem /home/runner/work/_temp/depends/x86_64-pc-linux-musl/include/QtNetwork -isystem /home/runner/work/_temp/depends/x86_64-pc-linux-musl/include/QtDBus -O0 -ftrapv -O1 -g3 -g3 -std=c++20 -fPIC -fvisibility=hidden -fvisibility-inlines-hidden -ffunction-sections -fdata-sections -fno-extended-identifiers -fmacro-prefix-map=/home/runner/work/_temp/src=. -fstack-reuse=none -U_FORTIFY_SOURCE -D_FORTIFY_SOURCE=3 -Wstack-protector -fstack-protector-all -fcf-protection=full -fstack-clash-protection -Wall -Wextra -Wformat -Wformat-security -Wvla -Wredundant-decls -Wdate-time -Wduplicated-branches -Wduplicated-cond -Wlogical-op -Woverloaded-virtual -Wsuggest-override -Wimplicit-fallthrough -Wunreachable-code -Wbidi-chars=any -Wundef -Wleading-whitespace=spaces -Wtrailing-whitespace=any -Wno-unused-parameter -Werror -MD -MT src/qt/CMakeFiles/bitcoinqt.dir/bitcoinunits.cpp.o -MF CMakeFiles/bitcoinqt.dir/bitcoinunits.cpp.o.d -o CMakeFiles/bitcoinqt.dir/bitcoinunits.cpp.o -c /home/runner/work/_temp/src/qt/bitcoinunits.cpp
38194s1%-DABORT_ON_FAILED_ASSUME -DBOOST_MULTI_INDEX_DISABLE_SERIALIZATION -DDEBUG -DDEBUG_LOCKCONTENTION -DDEBUG_LOCKORDER -DQT_CORE_LIB -DQT_DBUS_LIB -DQT_GUI_LIB -DQT_NETWORK_LIB -DQT_NO_KEYWORDS -DQT_USE_QSTRINGBUILDER -DQT_WIDGETS_LIB -DRPC_DOC_CHECK -D_GLIBCXX_DEBUG -D_GLIBCXX_DEBUG_PEDANTIC -D_LIBCPP_HARDENING_MODE=_LIBCPP_HARDENING_MODE_DEBUG -I"/home/runner/work/_temp/build_ ₿🧪_/src/qt/bitcoinqt_autogen/include" -I"/home/runner/work/_temp/build_ ₿🧪_/src" -I/home/runner/work/_temp/src -I/home/runner/work/_temp/src/univalue/include -I/home/runner/work/_temp/src/leveldb/include -isystem /home/runner/work/_temp/depends/x86_64-pc-linux-musl/include/QtWidgets -isystem /home/runner/work/_temp/depends/x86_64-pc-linux-musl/include -isystem /home/runner/work/_temp/depends/x86_64-pc-linux-musl/include/QtCore -isystem /home/runner/work/_temp/depends/x86_64-pc-linux-musl/mkspecs/linux-g++ -isystem /home/runner/work/_temp/depends/x86_64-pc-linux-musl/include/QtGui -isystem /home/runner/work/_temp/depends/x86_64-pc-linux-musl/boost/include -isystem /home/runner/work/_temp/depends/x86_64-pc-linux-musl/include/QtNetwork -isystem /home/runner/work/_temp/depends/x86_64-pc-linux-musl/include/QtDBus -O0 -ftrapv -O1 -g3 -g3 -std=c++20 -fPIC -fvisibility=hidden -fvisibility-inlines-hidden -ffunction-sections -fdata-sections -fno-extended-identifiers -fmacro-prefix-map=/home/runner/work/_temp/src=. -fstack-reuse=none -U_FORTIFY_SOURCE -D_FORTIFY_SOURCE=3 -Wstack-protector -fstack-protector-all -fcf-protection=full -fstack-clash-protection -Wall -Wextra -Wformat -Wformat-security -Wvla -Wredundant-decls -Wdate-time -Wduplicated-branches -Wduplicated-cond -Wlogical-op -Woverloaded-virtual -Wsuggest-override -Wimplicit-fallthrough -Wunreachable-code -Wbidi-chars=any -Wundef -Wleading-whitespace=spaces -Wtrailing-whitespace=any -Wno-unused-parameter -Werror -MD -MT src/qt/CMakeFiles/bitcoinqt.dir/clientmodel.cpp.o -MF CMakeFiles/bitcoinqt.dir/clientmodel.cpp.o.d -o CMakeFiles/bitcoinqt.dir/clientmodel.cpp.o -c /home/runner/work/_temp/src/qt/clientmodel.cpp
38375s2%-DABORT_ON_FAILED_ASSUME -DBOOST_MULTI_INDEX_DISABLE_SERIALIZATION -DDEBUG -DDEBUG_LOCKCONTENTION -DDEBUG_LOCKORDER -DQT_CORE_LIB -DQT_DBUS_LIB -DQT_GUI_LIB -DQT_NETWORK_LIB -DQT_NO_KEYWORDS -DQT_USE_QSTRINGBUILDER -DQT_WIDGETS_LIB -DRPC_DOC_CHECK -D_GLIBCXX_DEBUG -D_GLIBCXX_DEBUG_PEDANTIC -D_LIBCPP_HARDENING_MODE=_LIBCPP_HARDENING_MODE_DEBUG -I"/home/runner/work/_temp/build_ ₿🧪_/src/qt/bitcoinqt_autogen/include" -I"/home/runner/work/_temp/build_ ₿🧪_/src" -I/home/runner/work/_temp/src -I/home/runner/work/_temp/src/univalue/include -I/home/runner/work/_temp/src/leveldb/include -isystem /home/runner/work/_temp/depends/x86_64-pc-linux-musl/include/QtWidgets -isystem /home/runner/work/_temp/depends/x86_64-pc-linux-musl/include -isystem /home/runner/work/_temp/depends/x86_64-pc-linux-musl/include/QtCore -isystem /home/runner/work/_temp/depends/x86_64-pc-linux-musl/mkspecs/linux-g++ -isystem /home/runner/work/_temp/depends/x86_64-pc-linux-musl/include/QtGui -isystem /home/runner/work/_temp/depends/x86_64-pc-linux-musl/boost/include -isystem /home/runner/work/_temp/depends/x86_64-pc-linux-musl/include/QtNetwork -isystem /home/runner/work/_temp/depends/x86_64-pc-linux-musl/include/QtDBus -O0 -ftrapv -O1 -g3 -g3 -std=c++20 -fPIC -fvisibility=hidden -fvisibility-inlines-hidden -ffunction-sections -fdata-sections -fno-extended-identifiers -fmacro-prefix-map=/home/runner/work/_temp/src=. -fstack-reuse=none -U_FORTIFY_SOURCE -D_FORTIFY_SOURCE=3 -Wstack-protector -fstack-protector-all -fcf-protection=full -fstack-clash-protection -Wall -Wextra -Wformat -Wformat-security -Wvla -Wredundant-decls -Wdate-time -Wduplicated-branches -Wduplicated-cond -Wlogical-op -Woverloaded-virtual -Wsuggest-override -Wimplicit-fallthrough -Wunreachable-code -Wbidi-chars=any -Wundef -Wleading-whitespace=spaces -Wtrailing-whitespace=any -Wno-unused-parameter -Werror -MD -MT src/qt/CMakeFiles/bitcoinqt.dir/optionsdialog.cpp.o -MF CMakeFiles/bitcoinqt.dir/optionsdialog.cpp.o.d -o CMakeFiles/bitcoinqt.dir/optionsdialog.cpp.o -c /home/runner/work/_temp/src/qt/optionsdialog.cpp
38611s0%-DABORT_ON_FAILED_ASSUME -DBOOST_MULTI_INDEX_DISABLE_SERIALIZATION -DDEBUG -DDEBUG_LOCKCONTENTION -DDEBUG_LOCKORDER -DQT_CORE_LIB -DQT_DBUS_LIB -DQT_GUI_LIB -DQT_NETWORK_LIB -DQT_NO_KEYWORDS -DQT_USE_QSTRINGBUILDER -DQT_WIDGETS_LIB -DRPC_DOC_CHECK -D_GLIBCXX_DEBUG -D_GLIBCXX_DEBUG_PEDANTIC -D_LIBCPP_HARDENING_MODE=_LIBCPP_HARDENING_MODE_DEBUG -I"/home/runner/work/_temp/build_ ₿🧪_/src/qt/bitcoinqt_autogen/include" -I"/home/runner/work/_temp/build_ ₿🧪_/src" -I/home/runner/work/_temp/src -I/home/runner/work/_temp/src/univalue/include -I/home/runner/work/_temp/src/leveldb/include -isystem /home/runner/work/_temp/depends/x86_64-pc-linux-musl/include/QtWidgets -isystem /home/runner/work/_temp/depends/x86_64-pc-linux-musl/include -isystem /home/runner/work/_temp/depends/x86_64-pc-linux-musl/include/QtCore -isystem /home/runner/work/_temp/depends/x86_64-pc-linux-musl/mkspecs/linux-g++ -isystem /home/runner/work/_temp/depends/x86_64-pc-linux-musl/include/QtGui -isystem /home/runner/work/_temp/depends/x86_64-pc-linux-musl/boost/include -isystem /home/runner/work/_temp/depends/x86_64-pc-linux-musl/include/QtNetwork -isystem /home/runner/work/_temp/depends/x86_64-pc-linux-musl/include/QtDBus -O0 -ftrapv -O1 -g3 -g3 -std=c++20 -fPIC -fvisibility=hidden -fvisibility-inlines-hidden -ffunction-sections -fdata-sections -fno-extended-identifiers -fmacro-prefix-map=/home/runner/work/_temp/src=. -fstack-reuse=none -U_FORTIFY_SOURCE -D_FORTIFY_SOURCE=3 -Wstack-protector -fstack-protector-all -fcf-protection=full -fstack-clash-protection -Wall -Wextra -Wformat -Wformat-security -Wvla -Wredundant-decls -Wdate-time -Wduplicated-branches -Wduplicated-cond -Wlogical-op -Woverloaded-virtual -Wsuggest-override -Wimplicit-fallthrough -Wunreachable-code -Wbidi-chars=any -Wundef -Wleading-whitespace=spaces -Wtrailing-whitespace=any -Wno-unused-parameter -Werror -Wno-trailing-whitespace -MD -MT src/qt/CMakeFiles/bitcoinqt.dir/qrc_bitcoin_locale.cpp.o -MF CMakeFiles/bitcoinqt.dir/qrc_bitcoin_locale.cpp.o.d -o CMakeFiles/bitcoinqt.dir/qrc_bitcoin_locale.cpp.o -c "/home/runner/work/_temp/build_ ₿🧪_/src/qt/qrc_bitcoin_locale.cpp"
38794s1%-DABORT_ON_FAILED_ASSUME -DBOOST_MULTI_INDEX_DISABLE_SERIALIZATION -DDEBUG -DDEBUG_LOCKCONTENTION -DDEBUG_LOCKORDER -DQT_CORE_LIB -DQT_DBUS_LIB -DQT_GUI_LIB -DQT_NETWORK_LIB -DQT_NO_KEYWORDS -DQT_USE_QSTRINGBUILDER -DQT_WIDGETS_LIB -DRPC_DOC_CHECK -D_GLIBCXX_DEBUG -D_GLIBCXX_DEBUG_PEDANTIC -D_LIBCPP_HARDENING_MODE=_LIBCPP_HARDENING_MODE_DEBUG -I"/home/runner/work/_temp/build_ ₿🧪_/src/qt/bitcoinqt_autogen/include" -I"/home/runner/work/_temp/build_ ₿🧪_/src" -I/home/runner/work/_temp/src -I/home/runner/work/_temp/src/univalue/include -I/home/runner/work/_temp/src/leveldb/include -isystem /home/runner/work/_temp/depends/x86_64-pc-linux-musl/include/QtWidgets -isystem /home/runner/work/_temp/depends/x86_64-pc-linux-musl/include -isystem /home/runner/work/_temp/depends/x86_64-pc-linux-musl/include/QtCore -isystem /home/runner/work/_temp/depends/x86_64-pc-linux-musl/mkspecs/linux-g++ -isystem /home/runner/work/_temp/depends/x86_64-pc-linux-musl/include/QtGui -isystem /home/runner/work/_temp/depends/x86_64-pc-linux-musl/boost/include -isystem /home/runner/work/_temp/depends/x86_64-pc-linux-musl/include/QtNetwork -isystem /home/runner/work/_temp/depends/x86_64-pc-linux-musl/include/QtDBus -O0 -ftrapv -O1 -g3 -g3 -std=c++20 -fPIC -fvisibility=hidden -fvisibility-inlines-hidden -ffunction-sections -fdata-sections -fno-extended-identifiers -fmacro-prefix-map=/home/runner/work/_temp/src=. -fstack-reuse=none -U_FORTIFY_SOURCE -D_FORTIFY_SOURCE=3 -Wstack-protector -fstack-protector-all -fcf-protection=full -fstack-clash-protection -Wall -Wextra -Wformat -Wformat-security -Wvla -Wredundant-decls -Wdate-time -Wduplicated-branches -Wduplicated-cond -Wlogical-op -Woverloaded-virtual -Wsuggest-override -Wimplicit-fallthrough -Wunreachable-code -Wbidi-chars=any -Wundef -Wleading-whitespace=spaces -Wtrailing-whitespace=any -Wno-unused-parameter -Werror -MD -MT src/qt/CMakeFiles/bitcoinqt.dir/overviewpage.cpp.o -MF CMakeFiles/bitcoinqt.dir/overviewpage.cpp.o.d -o CMakeFiles/bitcoinqt.dir/overviewpage.cpp.o -c /home/runner/work/_temp/src/qt/overviewpage.cpp
38914s1%-DABORT_ON_FAILED_ASSUME -DBOOST_MULTI_INDEX_DISABLE_SERIALIZATION -DDEBUG -DDEBUG_LOCKCONTENTION -DDEBUG_LOCKORDER -DQT_CORE_LIB -DQT_DBUS_LIB -DQT_GUI_LIB -DQT_NETWORK_LIB -DQT_NO_KEYWORDS -DQT_USE_QSTRINGBUILDER -DQT_WIDGETS_LIB -DRPC_DOC_CHECK -D_GLIBCXX_DEBUG -D_GLIBCXX_DEBUG_PEDANTIC -D_LIBCPP_HARDENING_MODE=_LIBCPP_HARDENING_MODE_DEBUG -I"/home/runner/work/_temp/build_ ₿🧪_/src/qt/bitcoinqt_autogen/include" -I"/home/runner/work/_temp/build_ ₿🧪_/src" -I/home/runner/work/_temp/src -I/home/runner/work/_temp/src/univalue/include -I/home/runner/work/_temp/src/leveldb/include -isystem /home/runner/work/_temp/depends/x86_64-pc-linux-musl/include/QtWidgets -isystem /home/runner/work/_temp/depends/x86_64-pc-linux-musl/include -isystem /home/runner/work/_temp/depends/x86_64-pc-linux-musl/include/QtCore -isystem /home/runner/work/_temp/depends/x86_64-pc-linux-musl/mkspecs/linux-g++ -isystem /home/runner/work/_temp/depends/x86_64-pc-linux-musl/include/QtGui -isystem /home/runner/work/_temp/depends/x86_64-pc-linux-musl/boost/include -isystem /home/runner/work/_temp/depends/x86_64-pc-linux-musl/include/QtNetwork -isystem /home/runner/work/_temp/depends/x86_64-pc-linux-musl/include/QtDBus -O0 -ftrapv -O1 -g3 -g3 -std=c++20 -fPIC -fvisibility=hidden -fvisibility-inlines-hidden -ffunction-sections -fdata-sections -fno-extended-identifiers -fmacro-prefix-map=/home/runner/work/_temp/src=. -fstack-reuse=none -U_FORTIFY_SOURCE -D_FORTIFY_SOURCE=3 -Wstack-protector -fstack-protector-all -fcf-protection=full -fstack-clash-protection -Wall -Wextra -Wformat -Wformat-security -Wvla -Wredundant-decls -Wdate-time -Wduplicated-branches -Wduplicated-cond -Wlogical-op -Woverloaded-virtual -Wsuggest-override -Wimplicit-fallthrough -Wunreachable-code -Wbidi-chars=any -Wundef -Wleading-whitespace=spaces -Wtrailing-whitespace=any -Wno-unused-parameter -Werror -MD -MT src/qt/CMakeFiles/bitcoinqt.dir/recentrequeststablemodel.cpp.o -MF CMakeFiles/bitcoinqt.dir/recentrequeststablemodel.cpp.o.d -o CMakeFiles/bitcoinqt.dir/recentrequeststablemodel.cpp.o -c /home/runner/work/_temp/src/qt/recentrequeststablemodel.cpp
38953s1%-DABORT_ON_FAILED_ASSUME -DBOOST_MULTI_INDEX_DISABLE_SERIALIZATION -DDEBUG -DDEBUG_LOCKCONTENTION -DDEBUG_LOCKORDER -DQT_CORE_LIB -DQT_DBUS_LIB -DQT_GUI_LIB -DQT_NETWORK_LIB -DQT_NO_KEYWORDS -DQT_USE_QSTRINGBUILDER -DQT_WIDGETS_LIB -DRPC_DOC_CHECK -D_GLIBCXX_DEBUG -D_GLIBCXX_DEBUG_PEDANTIC -D_LIBCPP_HARDENING_MODE=_LIBCPP_HARDENING_MODE_DEBUG -I"/home/runner/work/_temp/build_ ₿🧪_/src/qt/bitcoinqt_autogen/include" -I"/home/runner/work/_temp/build_ ₿🧪_/src" -I/home/runner/work/_temp/src -I/home/runner/work/_temp/src/univalue/include -I/home/runner/work/_temp/src/leveldb/include -isystem /home/runner/work/_temp/depends/x86_64-pc-linux-musl/include/QtWidgets -isystem /home/runner/work/_temp/depends/x86_64-pc-linux-musl/include -isystem /home/runner/work/_temp/depends/x86_64-pc-linux-musl/include/QtCore -isystem /home/runner/work/_temp/depends/x86_64-pc-linux-musl/mkspecs/linux-g++ -isystem /home/runner/work/_temp/depends/x86_64-pc-linux-musl/include/QtGui -isystem /home/runner/work/_temp/depends/x86_64-pc-linux-musl/boost/include -isystem /home/runner/work/_temp/depends/x86_64-pc-linux-musl/include/QtNetwork -isystem /home/runner/work/_temp/depends/x86_64-pc-linux-musl/include/QtDBus -O0 -ftrapv -O1 -g3 -g3 -std=c++20 -fPIC -fvisibility=hidden -fvisibility-inlines-hidden -ffunction-sections -fdata-sections -fno-extended-identifiers -fmacro-prefix-map=/home/runner/work/_temp/src=. -fstack-reuse=none -U_FORTIFY_SOURCE -D_FORTIFY_SOURCE=3 -Wstack-protector -fstack-protector-all -fcf-protection=full -fstack-clash-protection -Wall -Wextra -Wformat -Wformat-security -Wvla -Wredundant-decls -Wdate-time -Wduplicated-branches -Wduplicated-cond -Wlogical-op -Woverloaded-virtual -Wsuggest-override -Wimplicit-fallthrough -Wunreachable-code -Wbidi-chars=any -Wundef -Wleading-whitespace=spaces -Wtrailing-whitespace=any -Wno-unused-parameter -Werror -MD -MT src/qt/CMakeFiles/bitcoinqt.dir/sendcoinsentry.cpp.o -MF CMakeFiles/bitcoinqt.dir/sendcoinsentry.cpp.o.d -o CMakeFiles/bitcoinqt.dir/sendcoinsentry.cpp.o -c /home/runner/work/_temp/src/qt/sendcoinsentry.cpp
39179s4%-DABORT_ON_FAILED_ASSUME -DBOOST_MULTI_INDEX_DISABLE_SERIALIZATION -DDEBUG -DDEBUG_LOCKCONTENTION -DDEBUG_LOCKORDER -DQT_CORE_LIB -DQT_DBUS_LIB -DQT_GUI_LIB -DQT_NETWORK_LIB -DQT_NO_KEYWORDS -DQT_USE_QSTRINGBUILDER -DQT_WIDGETS_LIB -DRPC_DOC_CHECK -D_GLIBCXX_DEBUG -D_GLIBCXX_DEBUG_PEDANTIC -D_LIBCPP_HARDENING_MODE=_LIBCPP_HARDENING_MODE_DEBUG -I"/home/runner/work/_temp/build_ ₿🧪_/src/qt/bitcoinqt_autogen/include" -I"/home/runner/work/_temp/build_ ₿🧪_/src" -I/home/runner/work/_temp/src -I/home/runner/work/_temp/src/univalue/include -I/home/runner/work/_temp/src/leveldb/include -isystem /home/runner/work/_temp/depends/x86_64-pc-linux-musl/include/QtWidgets -isystem /home/runner/work/_temp/depends/x86_64-pc-linux-musl/include -isystem /home/runner/work/_temp/depends/x86_64-pc-linux-musl/include/QtCore -isystem /home/runner/work/_temp/depends/x86_64-pc-linux-musl/mkspecs/linux-g++ -isystem /home/runner/work/_temp/depends/x86_64-pc-linux-musl/include/QtGui -isystem /home/runner/work/_temp/depends/x86_64-pc-linux-musl/boost/include -isystem /home/runner/work/_temp/depends/x86_64-pc-linux-musl/include/QtNetwork -isystem /home/runner/work/_temp/depends/x86_64-pc-linux-musl/include/QtDBus -O0 -ftrapv -O1 -g3 -g3 -std=c++20 -fPIC -fvisibility=hidden -fvisibility-inlines-hidden -ffunction-sections -fdata-sections -fno-extended-identifiers -fmacro-prefix-map=/home/runner/work/_temp/src=. -fstack-reuse=none -U_FORTIFY_SOURCE -D_FORTIFY_SOURCE=3 -Wstack-protector -fstack-protector-all -fcf-protection=full -fstack-clash-protection -Wall -Wextra -Wformat -Wformat-security -Wvla -Wredundant-decls -Wdate-time -Wduplicated-branches -Wduplicated-cond -Wlogical-op -Woverloaded-virtual -Wsuggest-override -Wimplicit-fallthrough -Wunreachable-code -Wbidi-chars=any -Wundef -Wleading-whitespace=spaces -Wtrailing-whitespace=any -Wno-unused-parameter -Werror -MD -MT src/qt/CMakeFiles/bitcoinqt.dir/walletmodel.cpp.o -MF CMakeFiles/bitcoinqt.dir/walletmodel.cpp.o.d -o CMakeFiles/bitcoinqt.dir/walletmodel.cpp.o -c /home/runner/work/_temp/src/qt/walletmodel.cpp
396911s5%-DABORT_ON_FAILED_ASSUME -DDEBUG -DDEBUG_LOCKCONTENTION -DDEBUG_LOCKORDER -DQT_CORE_LIB -DQT_GUI_LIB -DQT_NO_KEYWORDS -DQT_USE_QSTRINGBUILDER -DQT_WIDGETS_LIB -DRPC_DOC_CHECK -D_GLIBCXX_DEBUG -D_GLIBCXX_DEBUG_PEDANTIC -D_LIBCPP_HARDENING_MODE=_LIBCPP_HARDENING_MODE_DEBUG -I"/home/runner/work/_temp/build_ ₿🧪_/src/qt/bitcoin-qt_autogen/include" -I"/home/runner/work/_temp/build_ ₿🧪_/src" -I/home/runner/work/_temp/src -isystem /home/runner/work/_temp/depends/x86_64-pc-linux-musl/include/QtWidgets -isystem /home/runner/work/_temp/depends/x86_64-pc-linux-musl/include -isystem /home/runner/work/_temp/depends/x86_64-pc-linux-musl/include/QtCore -isystem /home/runner/work/_temp/depends/x86_64-pc-linux-musl/mkspecs/linux-g++ -isystem /home/runner/work/_temp/depends/x86_64-pc-linux-musl/include/QtGui -O0 -ftrapv -O1 -g3 -g3 -std=c++20 -fPIE -fvisibility=hidden -fvisibility-inlines-hidden -fno-extended-identifiers -fmacro-prefix-map=/home/runner/work/_temp/src=. -fstack-reuse=none -U_FORTIFY_SOURCE -D_FORTIFY_SOURCE=3 -Wstack-protector -fstack-protector-all -fcf-protection=full -fstack-clash-protection -Wall -Wextra -Wformat -Wformat-security -Wvla -Wredundant-decls -Wdate-time -Wduplicated-branches -Wduplicated-cond -Wlogical-op -Woverloaded-virtual -Wsuggest-override -Wimplicit-fallthrough -Wunreachable-code -Wbidi-chars=any -Wundef -Wleading-whitespace=spaces -Wtrailing-whitespace=any -Wno-unused-parameter -ffunction-sections -fdata-sections -Werror -MD -MT src/qt/CMakeFiles/bitcoin-qt.dir/__/init/bitcoin-qt.cpp.o -MF CMakeFiles/bitcoin-qt.dir/__/init/bitcoin-qt.cpp.o.d -o CMakeFiles/bitcoin-qt.dir/__/init/bitcoin-qt.cpp.o -c /home/runner/work/_temp/src/init/bitcoin-qt.cpp
401512s5%-DABORT_ON_FAILED_ASSUME -DDEBUG -DDEBUG_LOCKCONTENTION -DDEBUG_LOCKORDER -DQT_CORE_LIB -DQT_GUI_LIB -DQT_NO_KEYWORDS -DQT_USE_QSTRINGBUILDER -DQT_WIDGETS_LIB -DRPC_DOC_CHECK -D_GLIBCXX_DEBUG -D_GLIBCXX_DEBUG_PEDANTIC -D_LIBCPP_HARDENING_MODE=_LIBCPP_HARDENING_MODE_DEBUG -I"/home/runner/work/_temp/build_ ₿🧪_/src/qt/bitcoin-gui_autogen/include" -I"/home/runner/work/_temp/build_ ₿🧪_/src" -I/home/runner/work/_temp/src -I"/home/runner/work/_temp/build_ ₿🧪_/src/ipc" -I/home/runner/work/_temp/src/ipc/libmultiprocess/include -isystem /home/runner/work/_temp/depends/x86_64-pc-linux-musl/include/QtWidgets -isystem /home/runner/work/_temp/depends/x86_64-pc-linux-musl/include -isystem /home/runner/work/_temp/depends/x86_64-pc-linux-musl/include/QtCore -isystem /home/runner/work/_temp/depends/x86_64-pc-linux-musl/mkspecs/linux-g++ -isystem /home/runner/work/_temp/depends/x86_64-pc-linux-musl/include/QtGui -O0 -ftrapv -O1 -g3 -g3 -std=c++20 -fPIE -fvisibility=hidden -fvisibility-inlines-hidden -fno-extended-identifiers -fmacro-prefix-map=/home/runner/work/_temp/src=. -fstack-reuse=none -U_FORTIFY_SOURCE -D_FORTIFY_SOURCE=3 -Wstack-protector -fstack-protector-all -fcf-protection=full -fstack-clash-protection -Wall -Wextra -Wformat -Wformat-security -Wvla -Wredundant-decls -Wdate-time -Wduplicated-branches -Wduplicated-cond -Wlogical-op -Woverloaded-virtual -Wsuggest-override -Wimplicit-fallthrough -Wunreachable-code -Wbidi-chars=any -Wundef -Wleading-whitespace=spaces -Wtrailing-whitespace=any -Wno-unused-parameter -ffunction-sections -fdata-sections -Werror -MD -MT src/qt/CMakeFiles/bitcoin-gui.dir/__/init/bitcoin-gui.cpp.o -MF CMakeFiles/bitcoin-gui.dir/__/init/bitcoin-gui.cpp.o.d -o CMakeFiles/bitcoin-gui.dir/__/init/bitcoin-gui.cpp.o -c /home/runner/work/_temp/src/init/bitcoin-gui.cpp
413711s5%-DABORT_ON_FAILED_ASSUME -DBOOST_MULTI_INDEX_DISABLE_SERIALIZATION -DDEBUG -DDEBUG_LOCKCONTENTION -DDEBUG_LOCKORDER -DQT_CORE_LIB -DQT_GUI_LIB -DQT_NO_KEYWORDS -DQT_TESTCASE_BUILDDIR="\"/home/runner/work/_temp/build_ ₿🧪_/src/qt/test\"" -DQT_TESTCASE_SOURCEDIR=\"/home/runner/work/_temp/src/qt/test\" -DQT_TESTLIB_LIB -DQT_USE_QSTRINGBUILDER -DQT_WIDGETS_LIB -DRPC_DOC_CHECK -D_GLIBCXX_DEBUG -D_GLIBCXX_DEBUG_PEDANTIC -D_LIBCPP_HARDENING_MODE=_LIBCPP_HARDENING_MODE_DEBUG -I"/home/runner/work/_temp/build_ ₿🧪_/src/qt/test/test_bitcoin-qt_autogen/include" -I"/home/runner/work/_temp/build_ ₿🧪_/src" -I/home/runner/work/_temp/src -I/home/runner/work/_temp/src/univalue/include -isystem /home/runner/work/_temp/depends/x86_64-pc-linux-musl/include/QtWidgets -isystem /home/runner/work/_temp/depends/x86_64-pc-linux-musl/include -isystem /home/runner/work/_temp/depends/x86_64-pc-linux-musl/include/QtCore -isystem /home/runner/work/_temp/depends/x86_64-pc-linux-musl/mkspecs/linux-g++ -isystem /home/runner/work/_temp/depends/x86_64-pc-linux-musl/include/QtGui -isystem /home/runner/work/_temp/depends/x86_64-pc-linux-musl/boost/include -isystem /home/runner/work/_temp/depends/x86_64-pc-linux-musl/include/QtTest -O0 -ftrapv -O1 -g3 -g3 -std=c++20 -fPIE -fvisibility=hidden -fvisibility-inlines-hidden -fno-extended-identifiers -fmacro-prefix-map=/home/runner/work/_temp/src=. -fstack-reuse=none -U_FORTIFY_SOURCE -D_FORTIFY_SOURCE=3 -Wstack-protector -fstack-protector-all -fcf-protection=full -fstack-clash-protection -Wall -Wextra -Wformat -Wformat-security -Wvla -Wredundant-decls -Wdate-time -Wduplicated-branches -Wduplicated-cond -Wlogical-op -Woverloaded-virtual -Wsuggest-override -Wimplicit-fallthrough -Wunreachable-code -Wbidi-chars=any -Wundef -Wleading-whitespace=spaces -Wtrailing-whitespace=any -Wno-unused-parameter -ffunction-sections -fdata-sections -Werror -MD -MT src/qt/test/CMakeFiles/test_bitcoin-qt.dir/__/__/wallet/test/wallet_test_fixture.cpp.o -MF CMakeFiles/test_bitcoin-qt.dir/__/__/wallet/test/wallet_test_fixture.cpp.o.d -o CMakeFiles/test_bitcoin-qt.dir/__/__/wallet/test/wallet_test_fixture.cpp.o -c /home/runner/work/_temp/src/wallet/test/wallet_test_fixture.cpp
41522s0%-DABORT_ON_FAILED_ASSUME -DBOOST_MULTI_INDEX_DISABLE_SERIALIZATION -DDEBUG -DDEBUG_LOCKCONTENTION -DDEBUG_LOCKORDER -DRPC_DOC_CHECK -D_GLIBCXX_DEBUG -D_GLIBCXX_DEBUG_PEDANTIC -D_LIBCPP_HARDENING_MODE=_LIBCPP_HARDENING_MODE_DEBUG -I"/home/runner/work/_temp/build_ ₿🧪_/src" -I/home/runner/work/_temp/src -isystem /home/runner/work/_temp/depends/x86_64-pc-linux-musl/boost/include -O0 -ftrapv -O1 -g3 -g3 -std=c++20 -fPIE -fvisibility=hidden -fvisibility-inlines-hidden -fno-extended-identifiers -fmacro-prefix-map=/home/runner/work/_temp/src=. -fstack-reuse=none -U_FORTIFY_SOURCE -D_FORTIFY_SOURCE=3 -Wstack-protector -fstack-protector-all -fcf-protection=full -fstack-clash-protection -Wall -Wextra -Wformat -Wformat-security -Wvla -Wredundant-decls -Wdate-time -Wduplicated-branches -Wduplicated-cond -Wlogical-op -Woverloaded-virtual -Wsuggest-override -Wimplicit-fallthrough -Wunreachable-code -Wbidi-chars=any -Wundef -Wleading-whitespace=spaces -Wtrailing-whitespace=any -Wno-unused-parameter -Werror -MD -MT src/test/kernel/CMakeFiles/test_kernel.dir/test_kernel.cpp.o -MF CMakeFiles/test_kernel.dir/test_kernel.cpp.o.d -o CMakeFiles/test_kernel.dir/test_kernel.cpp.o -c /home/runner/work/_temp/src/test/kernel/test_kernel.cpp
41706s2%" " #op " " + stringify(rhs)); \
Tags
  • Alpine (musl)
  • remove-boost-test
  • FAILED